{"text_format":"1","workbook":"xlsx","n_sheets":4,"sheets":["クラス集計1回目","クラス集計2回目","個票","Sheet3"],"not_rendered":{"charts":6,"images":0,"macros":1,"external_links":0,"defined_names":1,"comments":0,"pivot_tables":0},"unopened":[],"bounds":{"document_bytes":16777216,"sheet_cells":100000,"rows_first":2000,"rows_last":500,"rows_between":2000,"halvings":0,"cell_chars":16384,"cell_head_chars":4096},"cells_cut":0,"cells_raw":0,"read":"whole","date_system":"1900"}

{"sheet":"クラス集計1回目","index":0,"n_rows":64,"n_cols":30,"rows_kept":64,"cut":false,"hidden":false,"merged":[[1,25,1,29],[1,23,2,23],[48,0,48,2],[1,3,1,22],[1,0,2,0],[1,1,2,1],[1,2,2,2]]}
["【学校名：",null,null,"学校】",null,null,"【クラス名：",null,null,null,"】",null,null,null,"【担任名：",null,null,null,null,null,"】"]
["出席\n番号","名前","性別","問　　　題　　　番　　　号　【解　　答　　欄】",null,null,null,null,null,null,null,null,null,null,null,null,null,null,null,null,null,null,null,"合計",null,"個人　領域ごとの正当数"]
[null,null,null,1,2,3,4,5,6,7,8,9,10,11,12,13,14,15,16,17,18,19,20,null,null,"情報モラル","参画する態度","情報技術","法律","機器の利用"]
[1,null,null,null,null,null,null,null,null,null,null,null,null,null,null,null,null,null,null,null,null,null,null,{"$f":"SUM(D4:W4)","v":0},null,{"$f":"SUM(クラス集計1回目!T4,クラス集計1回目!U4,クラス集計1回目!V4,クラス集計1回目!W4)","v":0},{"$f":"SUM(クラス集計1回目!P4,クラス集計1回目!Q4,クラス集計1回目!R4,クラス集計1回目!S4)","v":0},{"$f":"SUM(クラス集計1回目!L4,クラス集計1回目!M4,クラス集計1回目!N4,クラス集計1回目!O4)","v":0},{"$f":"SUM(クラス集計1回目!H4,クラス集計1回目!I4,クラス集計1回目!J4,クラス集計1回目!K4)","v":0},{"$f":"SUM(クラス集計1回目!D4,クラス集計1回目!E4,クラス集計1回目!F4,クラス集計1回目!G4)","v":0}]
[2,null,null,null,null,null,null,null,null,null,null,null,null,null,null,null,null,null,null,null,null,null,null,{"$f":"SUM(D5:W5)","v":0},null,{"$f":"SUM(クラス集計1回目!T5,クラス集計1回目!U5,クラス集計1回目!V5,クラス集計1回目!W5)","v":0},{"$f":"SUM(クラス集計1回目!P5,クラス集計1回目!Q5,クラス集計1回目!R5,クラス集計1回目!S5)","v":0},{"$f":"SUM(クラス集計1回目!L5,クラス集計1回目!M5,クラス集計1回目!N5,クラス集計1回目!O5)","v":0},{"$f":"SUM(クラス集計1回目!H5,クラス集計1回目!I5,クラス集計1回目!J5,クラス集計1回目!K5)","v":0},{"$f":"SUM(クラス集計1回目!D5,クラス集計1回目!E5,クラス集計1回目!F5,クラス集計1回目!G5)","v":0}]
[3,null,null,null,null,null,null,null,null,null,null,null,null,null,null,null,null,null,null,null,null,null,null,0,null,{"$f":"SUM(クラス集計1回目!T6,クラス集計1回目!U6,クラス集計1回目!V6,クラス集計1回目!W6)","v":0},{"$f":"SUM(クラス集計1回目!P6,クラス集計1回目!Q6,クラス集計1回目!R6,クラス集計1回目!S6)","v":0},{"$f":"SUM(クラス集計1回目!L6,クラス集計1回目!M6,クラス集計1回目!N6,クラス集計1回目!O6)","v":0},{"$f":"SUM(クラス集計1回目!H6,クラス集計1回目!I6,クラス集計1回目!J6,クラス集計1回目!K6)","v":0},{"$f":"SUM(クラス集計1回目!D6,クラス集計1回目!E6,クラス集計1回目!F6,クラス集計1回目!G6)","v":0}]
[4,null,null,null,null,null,null,null,null,null,null,null,null,null,null,null,null,null,null,null,null,null,null,0,null,{"$f":"SUM(クラス集計1回目!T7,クラス集計1回目!U7,クラス集計1回目!V7,クラス集計1回目!W7)","v":0},{"$f":"SUM(クラス集計1回目!P7,クラス集計1回目!Q7,クラス集計1回目!R7,クラス集計1回目!S7)","v":0},{"$f":"SUM(クラス集計1回目!L7,クラス集計1回目!M7,クラス集計1回目!N7,クラス集計1回目!O7)","v":0},{"$f":"SUM(クラス集計1回目!H7,クラス集計1回目!I7,クラス集計1回目!J7,クラス集計1回目!K7)","v":0},{"$f":"SUM(クラス集計1回目!D7,クラス集計1回目!E7,クラス集計1回目!F7,クラス集計1回目!G7)","v":0}]
[5,null,null,null,null,null,null,null,null,null,null,null,null,null,null,null,null,null,null,null,null,null,null,0,null,{"$f":"SUM(クラス集計1回目!T8,クラス集計1回目!U8,クラス集計1回目!V8,クラス集計1回目!W8)","v":0},{"$f":"SUM(クラス集計1回目!P8,クラス集計1回目!Q8,クラス集計1回目!R8,クラス集計1回目!S8)","v":0},{"$f":"SUM(クラス集計1回目!L8,クラス集計1回目!M8,クラス集計1回目!N8,クラス集計1回目!O8)","v":0},{"$f":"SUM(クラス集計1回目!H8,クラス集計1回目!I8,クラス集計1回目!J8,クラス集計1回目!K8)","v":0},{"$f":"SUM(クラス集計1回目!D8,クラス集計1回目!E8,クラス集計1回目!F8,クラス集計1回目!G8)","v":0}]
[6,null,null,null,null,null,null,null,null,null,null,null,null,null,null,null,null,null,null,null,null,null,null,0,null,{"$f":"SUM(クラス集計1回目!T9,クラス集計1回目!U9,クラス集計1回目!V9,クラス集計1回目!W9)","v":0},{"$f":"SUM(クラス集計1回目!P9,クラス集計1回目!Q9,クラス集計1回目!R9,クラス集計1回目!S9)","v":0},{"$f":"SUM(クラス集計1回目!L9,クラス集計1回目!M9,クラス集計1回目!N9,クラス集計1回目!O9)","v":0},{"$f":"SUM(クラス集計1回目!H9,クラス集計1回目!I9,クラス集計1回目!J9,クラス集計1回目!K9)","v":0},{"$f":"SUM(クラス集計1回目!D9,クラス集計1回目!E9,クラス集計1回目!F9,クラス集計1回目!G9)","v":0}]
[7,null,null,null,null,null,null,null,null,null,null,null,null,null,null,null,null,null,null,null,null,null,null,0,null,{"$f":"SUM(クラス集計1回目!T10,クラス集計1回目!U10,クラス集計1回目!V10,クラス集計1回目!W10)","v":0},{"$f":"SUM(クラス集計1回目!P10,クラス集計1回目!Q10,クラス集計1回目!R10,クラス集計1回目!S10)","v":0},{"$f":"SUM(クラス集計1回目!L10,クラス集計1回目!M10,クラス集計1回目!N10,クラス集計1回目!O10)","v":0},{"$f":"SUM(クラス集計1回目!H10,クラス集計1回目!I10,クラス集計1回目!J10,クラス集計1回目!K10)","v":0},{"$f":"SUM(クラス集計1回目!D10,クラス集計1回目!E10,クラス集計1回目!F10,クラス集計1回目!G10)","v":0}]
[8,null,null,null,null,null,null,null,null,null,null,null,null,null,null,null,null,null,null,null,null,null,null,0,null,{"$f":"SUM(クラス集計1回目!T11,クラス集計1回目!U11,クラス集計1回目!V11,クラス集計1回目!W11)","v":0},{"$f":"SUM(クラス集計1回目!P11,クラス集計1回目!Q11,クラス集計1回目!R11,クラス集計1回目!S11)","v":0},{"$f":"SUM(クラス集計1回目!L11,クラス集計1回目!M11,クラス集計1回目!N11,クラス集計1回目!O11)","v":0},{"$f":"SUM(クラス集計1回目!H11,クラス集計1回目!I11,クラス集計1回目!J11,クラス集計1回目!K11)","v":0},{"$f":"SUM(クラス集計1回目!D11,クラス集計1回目!E11,クラス集計1回目!F11,クラス集計1回目!G11)","v":0}]
[9,null,null,null,null,null,null,null,null,null,null,null,null,null,null,null,null,null,null,null,null,null,null,0,null,{"$f":"SUM(クラス集計1回目!T12,クラス集計1回目!U12,クラス集計1回目!V12,クラス集計1回目!W12)","v":0},{"$f":"SUM(クラス集計1回目!P12,クラス集計1回目!Q12,クラス集計1回目!R12,クラス集計1回目!S12)","v":0},{"$f":"SUM(クラス集計1回目!L12,クラス集計1回目!M12,クラス集計1回目!N12,クラス集計1回目!O12)","v":0},{"$f":"SUM(クラス集計1回目!H12,クラス集計1回目!I12,クラス集計1回目!J12,クラス集計1回目!K12)","v":0},{"$f":"SUM(クラス集計1回目!D12,クラス集計1回目!E12,クラス集計1回目!F12,クラス集計1回目!G12)","v":0}]
[10,null,null,null,null,null,null,null,null,null,null,null,null,null,null,null,null,null,null,null,null,null,null,0,null,{"$f":"SUM(クラス集計1回目!T13,クラス集計1回目!U13,クラス集計1回目!V13,クラス集計1回目!W13)","v":0},{"$f":"SUM(クラス集計1回目!P13,クラス集計1回目!Q13,クラス集計1回目!R13,クラス集計1回目!S13)","v":0},{"$f":"SUM(クラス集計1回目!L13,クラス集計1回目!M13,クラス集計1回目!N13,クラス集計1回目!O13)","v":0},{"$f":"SUM(クラス集計1回目!H13,クラス集計1回目!I13,クラス集計1回目!J13,クラス集計1回目!K13)","v":0},{"$f":"SUM(クラス集計1回目!D13,クラス集計1回目!E13,クラス集計1回目!F13,クラス集計1回目!G13)","v":0}]
[11,null,null,null,null,null,null,null,null,null,null,null,null,null,null,null,null,null,null,null,null,null,null,0,null,{"$f":"SUM(クラス集計1回目!T14,クラス集計1回目!U14,クラス集計1回目!V14,クラス集計1回目!W14)","v":0},{"$f":"SUM(クラス集計1回目!P14,クラス集計1回目!Q14,クラス集計1回目!R14,クラス集計1回目!S14)","v":0},{"$f":"SUM(クラス集計1回目!L14,クラス集計1回目!M14,クラス集計1回目!N14,クラス集計1回目!O14)","v":0},{"$f":"SUM(クラス集計1回目!H14,クラス集計1回目!I14,クラス集計1回目!J14,クラス集計1回目!K14)","v":0},{"$f":"SUM(クラス集計1回目!D14,クラス集計1回目!E14,クラス集計1回目!F14,クラス集計1回目!G14)","v":0}]
[12,null,null,null,null,null,null,null,null,null,null,null,null,null,null,null,null,null,null,null,null,null,null,0,null,{"$f":"SUM(クラス集計1回目!T15,クラス集計1回目!U15,クラス集計1回目!V15,クラス集計1回目!W15)","v":0},{"$f":"SUM(クラス集計1回目!P15,クラス集計1回目!Q15,クラス集計1回目!R15,クラス集計1回目!S15)","v":0},{"$f":"SUM(クラス集計1回目!L15,クラス集計1回目!M15,クラス集計1回目!N15,クラス集計1回目!O15)","v":0},{"$f":"SUM(クラス集計1回目!H15,クラス集計1回目!I15,クラス集計1回目!J15,クラス集計1回目!K15)","v":0},{"$f":"SUM(クラス集計1回目!D15,クラス集計1回目!E15,クラス集計1回目!F15,クラス集計1回目!G15)","v":0}]
[13,null,null,null,null,null,null,null,null,null,null,null,null,null,null,null,null,null,null,null,null,null,null,0,null,{"$f":"SUM(クラス集計1回目!T16,クラス集計1回目!U16,クラス集計1回目!V16,クラス集計1回目!W16)","v":0},{"$f":"SUM(クラス集計1回目!P16,クラス集計1回目!Q16,クラス集計1回目!R16,クラス集計1回目!S16)","v":0},{"$f":"SUM(クラス集計1回目!L16,クラス集計1回目!M16,クラス集計1回目!N16,クラス集計1回目!O16)","v":0},{"$f":"SUM(クラス集計1回目!H16,クラス集計1回目!I16,クラス集計1回目!J16,クラス集計1回目!K16)","v":0},{"$f":"SUM(クラス集計1回目!D16,クラス集計1回目!E16,クラス集計1回目!F16,クラス集計1回目!G16)","v":0}]
[14,null,null,null,null,null,null,null,null,null,null,null,null,null,null,null,null,null,null,null,null,null,null,0,null,{"$f":"SUM(クラス集計1回目!T17,クラス集計1回目!U17,クラス集計1回目!V17,クラス集計1回目!W17)","v":0},{"$f":"SUM(クラス集計1回目!P17,クラス集計1回目!Q17,クラス集計1回目!R17,クラス集計1回目!S17)","v":0},{"$f":"SUM(クラス集計1回目!L17,クラス集計1回目!M17,クラス集計1回目!N17,クラス集計1回目!O17)","v":0},{"$f":"SUM(クラス集計1回目!H17,クラス集計1回目!I17,クラス集計1回目!J17,クラス集計1回目!K17)","v":0},{"$f":"SUM(クラス集計1回目!D17,クラス集計1回目!E17,クラス集計1回目!F17,クラス集計1回目!G17)","v":0}]
[15,null,null,null,null,null,null,null,null,null,null,null,null,null,null,null,null,null,null,null,null,null,null,0,null,{"$f":"SUM(クラス集計1回目!T18,クラス集計1回目!U18,クラス集計1回目!V18,クラス集計1回目!W18)","v":0},{"$f":"SUM(クラス集計1回目!P18,クラス集計1回目!Q18,クラス集計1回目!R18,クラス集計1回目!S18)","v":0},{"$f":"SUM(クラス集計1回目!L18,クラス集計1回目!M18,クラス集計1回目!N18,クラス集計1回目!O18)","v":0},{"$f":"SUM(クラス集計1回目!H18,クラス集計1回目!I18,クラス集計1回目!J18,クラス集計1回目!K18)","v":0},{"$f":"SUM(クラス集計1回目!D18,クラス集計1回目!E18,クラス集計1回目!F18,クラス集計1回目!G18)","v":0}]
[16,null,null,null,null,null,null,null,null,null,null,null,null,null,null,null,null,null,null,null,null,null,null,0,null,{"$f":"SUM(クラス集計1回目!T19,クラス集計1回目!U19,クラス集計1回目!V19,クラス集計1回目!W19)","v":0},{"$f":"SUM(クラス集計1回目!P19,クラス集計1回目!Q19,クラス集計1回目!R19,クラス集計1回目!S19)","v":0},{"$f":"SUM(クラス集計1回目!L19,クラス集計1回目!M19,クラス集計1回目!N19,クラス集計1回目!O19)","v":0},{"$f":"SUM(クラス集計1回目!H19,クラス集計1回目!I19,クラス集計1回目!J19,クラス集計1回目!K19)","v":0},{"$f":"SUM(クラス集計1回目!D19,クラス集計1回目!E19,クラス集計1回目!F19,クラス集計1回目!G19)","v":0}]
[17,null,null,null,null,null,null,null,null,null,null,null,null,null,null,null,null,null,null,null,null,null,null,0,null,{"$f":"SUM(クラス集計1回目!T20,クラス集計1回目!U20,クラス集計1回目!V20,クラス集計1回目!W20)","v":0},{"$f":"SUM(クラス集計1回目!P20,クラス集計1回目!Q20,クラス集計1回目!R20,クラス集計1回目!S20)","v":0},{"$f":"SUM(クラス集計1回目!L20,クラス集計1回目!M20,クラス集計1回目!N20,クラス集計1回目!O20)","v":0},{"$f":"SUM(クラス集計1回目!H20,クラス集計1回目!I20,クラス集計1回目!J20,クラス集計1回目!K20)","v":0},{"$f":"SUM(クラス集計1回目!D20,クラス集計1回目!E20,クラス集計1回目!F20,クラス集計1回目!G20)","v":0}]
{"$rows_left_out":45}
{"sheet":"クラス集計2回目","index":1,"n_rows":64,"n_cols":30,"rows_kept":64,"cut":false,"hidden":false,"merged":[[48,0,48,2],[1,23,2,23],[1,25,1,29],[1,0,2,0],[1,1,2,1],[1,2,2,2],[1,3,1,22]]}
["【学校名：",null,{"$f":"IF(クラス集計1回目!C1=\"\",\"\",クラス集計1回目!C1)","v":""},"学校】",null,null,"【クラス名：",null,null,{"$f":"IF(クラス集計1回目!J1=\"\",\"\",クラス集計1回目!J1)","v":""},"】",null,null,null,"【担任名：",null,null,null,null,{"$f":"IF(クラス集計1回目!T1=\"\",\"\",クラス集計1回目!T1)","v":""},"】"]
["出席\n番号","名前","性別","問　　　題　　　番　　　号　【解　　答　　欄】",null,null,null,null,null,null,null,null,null,null,null,null,null,null,null,null,null,null,null,"合計",null,"個人　領域ごとの正当数"]
[null,null,null,1,2,3,4,5,6,7,8,9,10,11,12,13,14,15,16,17,18,19,20,null,null,"情報モラル","参画する態度","情報技術","法律","機器の利用"]
[1,{"$f":"IF(クラス集計1回目!B4=\"\",\"\",クラス集計1回目!B4)","v":""},{"$f":"IF(クラス集計1回目!C4=\"\",\"\",クラス集計1回目!C4)","v":""},null,null,null,null,null,null,null,null,null,null,null,null,null,null,null,null,null,null,null,null,{"$f":"SUM(D4:W4)","v":0},null,{"$f":"SUM(クラス集計2回目!T4,クラス集計2回目!U4,クラス集計2回目!V4,クラス集計2回目!W4)","v":0},{"$f":"SUM(クラス集計2回目!P4,クラス集計2回目!Q4,クラス集計2回目!R4,クラス集計2回目!S4)","v":0},{"$f":"SUM(クラス集計2回目!L4,クラス集計2回目!M4,クラス集計2回目!N4,クラス集計2回目!O4)","v":0},{"$f":"SUM(クラス集計2回目!H4,クラス集計2回目!I4,クラス集計2回目!J4,クラス集計2回目!K4)","v":0},{"$f":"SUM(クラス集計2回目!D4,クラス集計2回目!E4,クラス集計2回目!F4,クラス集計2回目!G4)","v":0}]
[2,{"$f":"IF(クラス集計1回目!B5=\"\",\"\",クラス集計1回目!B5)","v":""},{"$f":"IF(クラス集計1回目!C5=\"\",\"\",クラス集計1回目!C5)","v":""},null,null,null,null,null,null,null,null,null,null,null,null,null,null,null,null,null,null,null,null,{"$f":"SUM(D5:W5)","v":0},null,{"$f":"SUM(クラス集計2回目!T5,クラス集計2回目!U5,クラス集計2回目!V5,クラス集計2回目!W5)","v":0},{"$f":"SUM(クラス集計2回目!P5,クラス集計2回目!Q5,クラス集計2回目!R5,クラス集計2回目!S5)","v":0},{"$f":"SUM(クラス集計2回目!L5,クラス集計2回目!M5,クラス集計2回目!N5,クラス集計2回目!O5)","v":0},{"$f":"SUM(クラス集計2回目!H5,クラス集計2回目!I5,クラス集計2回目!J5,クラス集計2回目!K5)","v":0},{"$f":"SUM(クラス集計2回目!D5,クラス集計2回目!E5,クラス集計2回目!F5,クラス集計2回目!G5)","v":0}]
[3,{"$f":"IF(クラス集計1回目!B6=\"\",\"\",クラス集計1回目!B6)","v":""},{"$f":"IF(クラス集計1回目!C6=\"\",\"\",クラス集計1回目!C6)","v":""},null,null,null,null,null,null,null,null,null,null,null,null,null,null,null,null,null,null,null,null,0,null,{"$f":"SUM(クラス集計2回目!T6,クラス集計2回目!U6,クラス集計2回目!V6,クラス集計2回目!W6)","v":0},{"$f":"SUM(クラス集計2回目!P6,クラス集計2回目!Q6,クラス集計2回目!R6,クラス集計2回目!S6)","v":0},{"$f":"SUM(クラス集計2回目!L6,クラス集計2回目!M6,クラス集計2回目!N6,クラス集計2回目!O6)","v":0},{"$f":"SUM(クラス集計2回目!H6,クラス集計2回目!I6,クラス集計2回目!J6,クラス集計2回目!K6)","v":0},{"$f":"SUM(クラス集計2回目!D6,クラス集計2回目!E6,クラス集計2回目!F6,クラス集計2回目!G6)","v":0}]
[4,{"$f":"IF(クラス集計1回目!B7=\"\",\"\",クラス集計1回目!B7)","v":""},{"$f":"IF(クラス集計1回目!C7=\"\",\"\",クラス集計1回目!C7)","v":""},null,null,null,null,null,null,null,null,null,null,null,null,null,null,null,null,null,null,null,null,0,null,{"$f":"SUM(クラス集計2回目!T7,クラス集計2回目!U7,クラス集計2回目!V7,クラス集計2回目!W7)","v":0},{"$f":"SUM(クラス集計2回目!P7,クラス集計2回目!Q7,クラス集計2回目!R7,クラス集計2回目!S7)","v":0},{"$f":"SUM(クラス集計2回目!L7,クラス集計2回目!M7,クラス集計2回目!N7,クラス集計2回目!O7)","v":0},{"$f":"SUM(クラス集計2回目!H7,クラス集計2回目!I7,クラス集計2回目!J7,クラス集計2回目!K7)","v":0},{"$f":"SUM(クラス集計2回目!D7,クラス集計2回目!E7,クラス集計2回目!F7,クラス集計2回目!G7)","v":0}]
[5,{"$f":"IF(クラス集計1回目!B8=\"\",\"\",クラス集計1回目!B8)","v":""},{"$f":"IF(クラス集計1回目!C8=\"\",\"\",クラス集計1回目!C8)","v":""},null,null,null,null,null,null,null,null,null,null,null,null,null,null,null,null,null,null,null,null,0,null,{"$f":"SUM(クラス集計2回目!T8,クラス集計2回目!U8,クラス集計2回目!V8,クラス集計2回目!W8)","v":0},{"$f":"SUM(クラス集計2回目!P8,クラス集計2回目!Q8,クラス集計2回目!R8,クラス集計2回目!S8)","v":0},{"$f":"SUM(クラス集計2回目!L8,クラス集計2回目!M8,クラス集計2回目!N8,クラス集計2回目!O8)","v":0},{"$f":"SUM(クラス集計2回目!H8,クラス集計2回目!I8,クラス集計2回目!J8,クラス集計2回目!K8)","v":0},{"$f":"SUM(クラス集計2回目!D8,クラス集計2回目!E8,クラス集計2回目!F8,クラス集計2回目!G8)","v":0}]
[6,{"$f":"IF(クラス集計1回目!B9=\"\",\"\",クラス集計1回目!B9)","v":""},{"$f":"IF(クラス集計1回目!C9=\"\",\"\",クラス集計1回目!C9)","v":""},null,null,null,null,null,null,null,null,null,null,null,null,null,null,null,null,null,null,null,null,0,null,{"$f":"SUM(クラス集計2回目!T9,クラス集計2回目!U9,クラス集計2回目!V9,クラス集計2回目!W9)","v":0},{"$f":"SUM(クラス集計2回目!P9,クラス集計2回目!Q9,クラス集計2回目!R9,クラス集計2回目!S9)","v":0},{"$f":"SUM(クラス集計2回目!L9,クラス集計2回目!M9,クラス集計2回目!N9,クラス集計2回目!O9)","v":0},{"$f":"SUM(クラス集計2回目!H9,クラス集計2回目!I9,クラス集計2回目!J9,クラス集計2回目!K9)","v":0},{"$f":"SUM(クラス集計2回目!D9,クラス集計2回目!E9,クラス集計2回目!F9,クラス集計2回目!G9)","v":0}]
[7,{"$f":"IF(クラス集計1回目!B10=\"\",\"\",クラス集計1回目!B10)","v":""},{"$f":"IF(クラス集計1回目!C10=\"\",\"\",クラス集計1回目!C10)","v":""},null,null,null,null,null,null,null,null,null,null,null,null,null,null,null,null,null,null,null,null,0,null,{"$f":"SUM(クラス集計2回目!T10,クラス集計2回目!U10,クラス集計2回目!V10,クラス集計2回目!W10)","v":0},{"$f":"SUM(クラス集計2回目!P10,クラス集計2回目!Q10,クラス集計2回目!R10,クラス集計2回目!S10)","v":0},{"$f":"SUM(クラス集計2回目!L10,クラス集計2回目!M10,クラス集計2回目!N10,クラス集計2回目!O10)","v":0},{"$f":"SUM(クラス集計2回目!H10,クラス集計2回目!I10,クラス集計2回目!J10,クラス集計2回目!K10)","v":0},{"$f":"SUM(クラス集計2回目!D10,クラス集計2回目!E10,クラス集計2回目!F10,クラス集計2回目!G10)","v":0}]
[8,{"$f":"IF(クラス集計1回目!B11=\"\",\"\",クラス集計1回目!B11)","v":""},{"$f":"IF(クラス集計1回目!C11=\"\",\"\",クラス集計1回目!C11)","v":""},null,null,null,null,null,null,null,null,null,null,null,null,null,null,null,null,null,null,null,null,0,null,{"$f":"SUM(クラス集計2回目!T11,クラス集計2回目!U11,クラス集計2回目!V11,クラス集計2回目!W11)","v":0},{"$f":"SUM(クラス集計2回目!P11,クラス集計2回目!Q11,クラス集計2回目!R11,クラス集計2回目!S11)","v":0},{"$f":"SUM(クラス集計2回目!L11,クラス集計2回目!M11,クラス集計2回目!N11,クラス集計2回目!O11)","v":0},{"$f":"SUM(クラス集計2回目!H11,クラス集計2回目!I11,クラス集計2回目!J11,クラス集計2回目!K11)","v":0},{"$f":"SUM(クラス集計2回目!D11,クラス集計2回目!E11,クラス集計2回目!F11,クラス集計2回目!G11)","v":0}]
[9,{"$f":"IF(クラス集計1回目!B12=\"\",\"\",クラス集計1回目!B12)","v":""},{"$f":"IF(クラス集計1回目!C12=\"\",\"\",クラス集計1回目!C12)","v":""},null,null,null,null,null,null,null,null,null,null,null,null,null,null,null,null,null,null,null,null,0,null,{"$f":"SUM(クラス集計2回目!T12,クラス集計2回目!U12,クラス集計2回目!V12,クラス集計2回目!W12)","v":0},{"$f":"SUM(クラス集計2回目!P12,クラス集計2回目!Q12,クラス集計2回目!R12,クラス集計2回目!S12)","v":0},{"$f":"SUM(クラス集計2回目!L12,クラス集計2回目!M12,クラス集計2回目!N12,クラス集計2回目!O12)","v":0},{"$f":"SUM(クラス集計2回目!H12,クラス集計2回目!I12,クラス集計2回目!J12,クラス集計2回目!K12)","v":0},{"$f":"SUM(クラス集計2回目!D12,クラス集計2回目!E12,クラス集計2回目!F12,クラス集計2回目!G12)","v":0}]
[10,{"$f":"IF(クラス集計1回目!B13=\"\",\"\",クラス集計1回目!B13)","v":""},{"$f":"IF(クラス集計1回目!C13=\"\",\"\",クラス集計1回目!C13)","v":""},null,null,null,null,null,null,null,null,null,null,null,null,null,null,null,null,null,null,null,null,0,null,{"$f":"SUM(クラス集計2回目!T13,クラス集計2回目!U13,クラス集計2回目!V13,クラス集計2回目!W13)","v":0},{"$f":"SUM(クラス集計2回目!P13,クラス集計2回目!Q13,クラス集計2回目!R13,クラス集計2回目!S13)","v":0},{"$f":"SUM(クラス集計2回目!L13,クラス集計2回目!M13,クラス集計2回目!N13,クラス集計2回目!O13)","v":0},{"$f":"SUM(クラス集計2回目!H13,クラス集計2回目!I13,クラス集計2回目!J13,クラス集計2回目!K13)","v":0},{"$f":"SUM(クラス集計2回目!D13,クラス集計2回目!E13,クラス集計2回目!F13,クラス集計2回目!G13)","v":0}]
[11,{"$f":"IF(クラス集計1回目!B14=\"\",\"\",クラス集計1回目!B14)","v":""},{"$f":"IF(クラス集計1回目!C14=\"\",\"\",クラス集計1回目!C14)","v":""},null,null,null,null,null,null,null,null,null,null,null,null,null,null,null,null,null,null,null,null,0,null,{"$f":"SUM(クラス集計2回目!T14,クラス集計2回目!U14,クラス集計2回目!V14,クラス集計2回目!W14)","v":0},{"$f":"SUM(クラス集計2回目!P14,クラス集計2回目!Q14,クラス集計2回目!R14,クラス集計2回目!S14)","v":0},{"$f":"SUM(クラス集計2回目!L14,クラス集計2回目!M14,クラス集計2回目!N14,クラス集計2回目!O14)","v":0},{"$f":"SUM(クラス集計2回目!H14,クラス集計2回目!I14,クラス集計2回目!J14,クラス集計2回目!K14)","v":0},{"$f":"SUM(クラス集計2回目!D14,クラス集計2回目!E14,クラス集計2回目!F14,クラス集計2回目!G14)","v":0}]
[12,{"$f":"IF(クラス集計1回目!B15=\"\",\"\",クラス集計1回目!B15)","v":""},{"$f":"IF(クラス集計1回目!C15=\"\",\"\",クラス集計1回目!C15)","v":""},null,null,null,null,null,null,null,null,null,null,null,null,null,null,null,null,null,null,null,null,0,null,{"$f":"SUM(クラス集計2回目!T15,クラス集計2回目!U15,クラス集計2回目!V15,クラス集計2回目!W15)","v":0},{"$f":"SUM(クラス集計2回目!P15,クラス集計2回目!Q15,クラス集計2回目!R15,クラス集計2回目!S15)","v":0},{"$f":"SUM(クラス集計2回目!L15,クラス集計2回目!M15,クラス集計2回目!N15,クラス集計2回目!O15)","v":0},{"$f":"SUM(クラス集計2回目!H15,クラス集計2回目!I15,クラス集計2回目!J15,クラス集計2回目!K15)","v":0},{"$f":"SUM(クラス集計2回目!D15,クラス集計2回目!E15,クラス集計2回目!F15,クラス集計2回目!G15)","v":0}]
[13,{"$f":"IF(クラス集計1回目!B16=\"\",\"\",クラス集計1回目!B16)","v":""},{"$f":"IF(クラス集計1回目!C16=\"\",\"\",クラス集計1回目!C16)","v":""},null,null,null,null,null,null,null,null,null,null,null,null,null,null,null,null,null,null,null,null,0,null,{"$f":"SUM(クラス集計2回目!T16,クラス集計2回目!U16,クラス集計2回目!V16,クラス集計2回目!W16)","v":0},{"$f":"SUM(クラス集計2回目!P16,クラス集計2回目!Q16,クラス集計2回目!R16,クラス集計2回目!S16)","v":0},{"$f":"SUM(クラス集計2回目!L16,クラス集計2回目!M16,クラス集計2回目!N16,クラス集計2回目!O16)","v":0},{"$f":"SUM(クラス集計2回目!H16,クラス集計2回目!I16,クラス集計2回目!J16,クラス集計2回目!K16)","v":0},{"$f":"SUM(クラス集計2回目!D16,クラス集計2回目!E16,クラス集計2回目!F16,クラス集計2回目!G16)","v":0}]
[14,{"$f":"IF(クラス集計1回目!B17=\"\",\"\",クラス集計1回目!B17)","v":""},{"$f":"IF(クラス集計1回目!C17=\"\",\"\",クラス集計1回目!C17)","v":""},null,null,null,null,null,null,null,null,null,null,null,null,null,null,null,null,null,null,null,null,0,null,{"$f":"SUM(クラス集計2回目!T17,クラス集計2回目!U17,クラス集計2回目!V17,クラス集計2回目!W17)","v":0},{"$f":"SUM(クラス集計2回目!P17,クラス集計2回目!Q17,クラス集計2回目!R17,クラス集計2回目!S17)","v":0},{"$f":"SUM(クラス集計2回目!L17,クラス集計2回目!M17,クラス集計2回目!N17,クラス集計2回目!O17)","v":0},{"$f":"SUM(クラス集計2回目!H17,クラス集計2回目!I17,クラス集計2回目!J17,クラス集計2回目!K17)","v":0},{"$f":"SUM(クラス集計2回目!D17,クラス集計2回目!E17,クラス集計2回目!F17,クラス集計2回目!G17)","v":0}]
[15,{"$f":"IF(クラス集計1回目!B18=\"\",\"\",クラス集計1回目!B18)","v":""},{"$f":"IF(クラス集計1回目!C18=\"\",\"\",クラス集計1回目!C18)","v":""},null,null,null,null,null,null,null,null,null,null,null,null,null,null,null,null,null,null,null,null,0,null,{"$f":"SUM(クラス集計2回目!T18,クラス集計2回目!U18,クラス集計2回目!V18,クラス集計2回目!W18)","v":0},{"$f":"SUM(クラス集計2回目!P18,クラス集計2回目!Q18,クラス集計2回目!R18,クラス集計2回目!S18)","v":0},{"$f":"SUM(クラス集計2回目!L18,クラス集計2回目!M18,クラス集計2回目!N18,クラス集計2回目!O18)","v":0},{"$f":"SUM(クラス集計2回目!H18,クラス集計2回目!I18,クラス集計2回目!J18,クラス集計2回目!K18)","v":0},{"$f":"SUM(クラス集計2回目!D18,クラス集計2回目!E18,クラス集計2回目!F18,クラス集計2回目!G18)","v":0}]
[16,{"$f":"IF(クラス集計1回目!B19=\"\",\"\",クラス集計1回目!B19)","v":""},{"$f":"IF(クラス集計1回目!C19=\"\",\"\",クラス集計1回目!C19)","v":""},null,null,null,null,null,null,null,null,null,null,null,null,null,null,null,null,null,null,null,null,0,null,{"$f":"SUM(クラス集計2回目!T19,クラス集計2回目!U19,クラス集計2回目!V19,クラス集計2回目!W19)","v":0},{"$f":"SUM(クラス集計2回目!P19,クラス集計2回目!Q19,クラス集計2回目!R19,クラス集計2回目!S19)","v":0},{"$f":"SUM(クラス集計2回目!L19,クラス集計2回目!M19,クラス集計2回目!N19,クラス集計2回目!O19)","v":0},{"$f":"SUM(クラス集計2回目!H19,クラス集計2回目!I19,クラス集計2回目!J19,クラス集計2回目!K19)","v":0},{"$f":"SUM(クラス集計2回目!D19,クラス集計2回目!E19,クラス集計2回目!F19,クラス集計2回目!G19)","v":0}]
[17,{"$f":"IF(クラス集計1回目!B20=\"\",\"\",クラス集計1回目!B20)","v":""},{"$f":"IF(クラス集計1回目!C20=\"\",\"\",クラス集計1回目!C20)","v":""},null,null,null,null,null,null,null,null,null,null,null,null,null,null,null,null,null,null,null,null,0,null,{"$f":"SUM(クラス集計2回目!T20,クラス集計2回目!U20,クラス集計2回目!V20,クラス集計2回目!W20)","v":0},{"$f":"SUM(クラス集計2回目!P20,クラス集計2回目!Q20,クラス集計2回目!R20,クラス集計2回目!S20)","v":0},{"$f":"SUM(クラス集計2回目!L20,クラス集計2回目!M20,クラス集計2回目!N20,クラス集計2回目!O20)","v":0},{"$f":"SUM(クラス集計2回目!H20,クラス集計2回目!I20,クラス集計2回目!J20,クラス集計2回目!K20)","v":0},{"$f":"SUM(クラス集計2回目!D20,クラス集計2回目!E20,クラス集計2回目!F20,クラス集計2回目!G20)","v":0}]
{"$rows_left_out":45}
{"sheet":"個票","index":2,"n_rows":40,"n_cols":13,"rows_kept":40,"cut":false,"hidden":false,"merged":[[1,3,1,4],[31,3,31,4],[5,8,7,10],[10,8,10,10],[14,8,16,10]]}
[]
[null,{"$f":"VLOOKUP($I$3,クラス集計1回目!$A$4:$AD$48,1,0)","v":1},"番　名前",{"$f":"VLOOKUP($I$3,クラス集計1回目!$A$4:$AD$48,2,0)","v":0},null,{"$f":"VLOOKUP($I$3,クラス集計1回目!$A$4:$AD$48,3,0)","v":0},null,null,"単票印刷用"]
[null,null,null,null,null,null,null,null,1]
[null,"第1回目領域"]
[null,"情報モラル","参画する態度","情報技術","法律","機器の利用",null,null,"※出席番号の入力"]
[null,{"$f":"VLOOKUP($I$3,クラス集計1回目!$A$4:$AD$48,26,0)","v":0},{"$f":"VLOOKUP($I$3,クラス集計1回目!$A$4:$AD$48,27,0)","v":0},{"$f":"VLOOKUP($I$3,クラス集計1回目!$A$4:$AD$48,28,0)","v":0},{"$f":"VLOOKUP($I$3,クラス集計1回目!$A$4:$AD$48,29,0)","v":0},{"$f":"VLOOKUP($I$3,クラス集計1回目!$A$4:$AD$48,30,0)","v":0},null,null,"シート１枚に２名分印刷されるので奇数を打ち込み印刷してください。"]
[]
[null,"第2回目領域"]
[null,"情報モラル","参画する態度","情報技術","法律","機器の利用"]
[null,{"$f":"VLOOKUP($I$3,クラス集計2回目!$A$4:$AD$43,26,0)","v":0},{"$f":"VLOOKUP($I$3,クラス集計2回目!$A$4:$AD$43,27,0)","v":0},{"$f":"VLOOKUP($I$3,クラス集計2回目!$A$4:$AD$43,28,0)","v":0},{"$f":"VLOOKUP($I$3,クラス集計2回目!$A$4:$AD$43,29,0)","v":0},{"$f":"VLOOKUP($I$3,クラス集計2回目!$A$4:$AD$43,30,0)","v":0}]
[null,null,null,null,null,null,null,null,"連続印刷用"]
[null,null,null,null,null,null,null,null,null,"～",null,null,2]
[null,null,null,null,null,null,null,null,null,null,null,null,{"$f":"I3+M12","v":3}]
[null,null,null,null,null,null,null,null,"※出席番号の入力"]
[null,null,null,null,null,null,null,null,"印刷したい範囲の出席番号を上に入力して、下の印刷ボタンを押してください。"]
[]
[]
[]
[]
[]
{"$rows_left_out":21}
{"sheet":"Sheet3","index":3,"n_rows":0,"n_cols":0,"rows_kept":0,"cut":false,"hidden":true,"merged":[]}